Reaction Details
TargetCoagulation factor XI
LigandBDBM304153
Substrate/Competitorn/a
Meas. Tech.Factor XIa Assay
IC50 0.380±n/a nM
Citation Shen, DKuang, RKumar, PDuffy, JLZhu, CAli, AYang, MDebenham, JS Factor XIa inhibitors US Patent US10143681 Publication Date 12/4/2018
 
Coagulation factor XI
Name:Coagulation factor XI
Type:Enzyme
Mol. Mass.:70130.58
Organism:Homo sapiens (Human)
Description:P03951
Residue:625
BDBM304153
NameBDBM304153
Synonyms:2-((R)-1-((4- carboxyphenyl)amino)-3- ((1S,2R)-2- methylcyclopropyl)-1- oxopropan-2-yl)-5-(3-chloro- 6-(difluoromethoxy)-2- fluorophenyl)pyridine 1- oxide | US10143681, Example 56
TypeSmall organic molecule
Emp. Form.C26H22ClF3N2O5
Mol. Mass.534.911
SMILESC[C@@H]1C[C@H]1C[C@@H](C(=O)Nc1ccc(cc1)C(O)=O)c1ccc(c[n+]1[O-])-c1c(F)c(Cl)ccc1OC(F)F