Reaction Details
TargetCoagulation factor XI
LigandBDBM304228
Substrate/Competitorn/a
Meas. Tech.Factor XIa Assay
IC50 0.100±n/a nM
Citation Shen, DKuang, RKumar, PDuffy, JLZhu, CAli, AYang, MDebenham, JS Factor XIa inhibitors US Patent US10143681 Publication Date 12/4/2018
 
Coagulation factor XI
Name:Coagulation factor XI
Type:Enzyme
Mol. Mass.:70130.58
Organism:Homo sapiens (Human)
Description:P03951
Residue:625
BDBM304228
NameBDBM304228
Synonyms:2-(1-((4-carboxy-3- fluorophenyl)amino)-3- cyclobutyl-1-oxopropan-2- yl)-5-(3-chloro-6- (difluoromethyl)-2- fluorophenyl)pyridine 1- oxide US10143681, Example 119
TypeSmall organic molecule
Emp. Form.C26H21ClF4N2O4
Mol. Mass.536.903
SMILESOC(=O)c1ccc(NC(=O)C(CC2CCC2)c2ccc(c[n+]2[O-])-c2c(F)c(Cl)ccc2C(F)F)cc1F