Reaction Details
TargetProtein kinase C beta type
LigandBDBM286318
Substrate/Competitorn/a
Meas. Tech.Protein Kinase C beta 2 Assay
Ki 6.43±n/a nM
Citation Li, HNukui, SScales, SATeng, MYin, C Substituted n-pyrimidin-4-yl-3-amino-pyrrolo[3,4-c]pyrazoles as protein kinase C inhibitors US Patent US11220518 Publication Date 1/11/2022
 
Protein kinase C beta type
Name:Protein kinase C beta type
Type:Enzyme
Mol. Mass.:76873.67
Organism:Homo sapiens (Human)
Description:The recombinant human PKC enzymes were produced using a baculovirus expression system in SF9 cells
Residue:671
BDBM286318
NameBDBM286318
Synonyms:US11220518, Ex. No. J5 US9518060, Example J5
TypeSmall organic molecule
Emp. Form.C22H30FN7O
Mol. Mass.427.5183
SMILESC[C@H]1CN2CCC[C@H]2CN1C(=O)N1Cc2c(Nc3nc(C)ccc3F)n[nH]c2C1(C)C