Reaction Details
TargetBeta-hexosaminidase subunit beta
LigandBDBM304400
Substrate/Competitorn/a
Meas. Tech.Inhibition of Mast Cell Degranulation
IC50 3100±n/a nM
Citation Schlechtingen, GKnolker, HFriedrichson, TJennings, GBraxmeier, T Hydroxy-substituted amino and ammonium derivatives and their medical use US Patent US10143668 Publication Date 12/4/2018
 
Beta-hexosaminidase subunit beta
Name:Beta-hexosaminidase subunit beta
Type:Enzyme
Mol. Mass.:63112.58
Organism:Homo sapiens (Human)
Description:P07686
Residue:556
BDBM304400
NameBDBM304400
Synonyms:US10143668, Compound 1d
TypeSmall organic molecule
Emp. Form.C22H47N2O3
Mol. Mass.387.6196
[N+](C)(C)CC(=O)N(C)CC(O)CO