Reaction Details
TargetProtein mono-ADP-ribosyltransferase PARP6
LigandBDBM553944
Substrate/Competitorn/a
Meas. Tech.Fluorescence Anisotropy Binding Assay
IC50 18000±n/a nM
Citation Johannes, JWHande, SMDegorce, SLPacker, MJ Chemical compounds US Patent US11325906 Publication Date 5/10/2022
 
Protein mono-ADP-ribosyltransferase PARP6
Name:Protein mono-ADP-ribosyltransferase PARP6
Type:PROTEIN
Mol. Mass.:71130.07
Organism:Homo sapiens (Human)
Description:ChEMBL_107589
Residue:630
BDBM553944
NameBDBM553944
Synonyms:US11325906, Example 8
TypeSmall organic molecule
Emp. Form.C24H30N6O2
Mol. Mass.434.534
SMILESCCc1nc(ccc1N1CCN(Cc2ccc3nc(CC)c(=O)[nH]c3c2)CC1)C(=O)NC