Reaction Details
TargetProtein mono-ADP-ribosyltransferase PARP6
LigandBDBM553954
Substrate/Competitorn/a
Meas. Tech.Fluorescence Anisotropy Binding Assay
IC50 59000±n/a nM
Citation Johannes, JWHande, SMDegorce, SLPacker, MJ Chemical compounds US Patent US11325906 Publication Date 5/10/2022
 
Protein mono-ADP-ribosyltransferase PARP6
Name:Protein mono-ADP-ribosyltransferase PARP6
Type:PROTEIN
Mol. Mass.:71130.07
Organism:Homo sapiens (Human)
Description:ChEMBL_107589
Residue:630
BDBM553954
NameBDBM553954
Synonyms:US11325906, Example 17
TypeSmall organic molecule
Emp. Form.C21H20F4N6O2
Mol. Mass.464.4161
SMILESCNC(=O)c1ccc(N2CCN(Cc3ccc4nc(c(=O)[nH]c4c3)C(F)(F)F)CC2)c(F)n1