Reaction Details
TargetProtein mono-ADP-ribosyltransferase PARP6
LigandBDBM553957
Substrate/Competitorn/a
Meas. Tech.Fluorescence Anisotropy Binding Assay
IC50>100000±n/a nM
Citation Johannes, JWHande, SMDegorce, SLPacker, MJ Chemical compounds US Patent US11325906 Publication Date 5/10/2022
 
Protein mono-ADP-ribosyltransferase PARP6
Name:Protein mono-ADP-ribosyltransferase PARP6
Type:PROTEIN
Mol. Mass.:71130.07
Organism:Homo sapiens (Human)
Description:ChEMBL_107589
Residue:630
BDBM553957
NameBDBM553957
Synonyms:US11325906, Example 20
TypeSmall organic molecule
Emp. Form.C23H27FN6O2
Mol. Mass.438.4979
SMILESCCCc1nc2ccc(CN3CCN(CC3)c3ccc(nc3F)C(=O)NC)cc2[nH]c1=O