Reaction Details
TargetProtein mono-ADP-ribosyltransferase PARP6
LigandBDBM553966
Substrate/Competitorn/a
Meas. Tech.Fluorescence Anisotropy Binding Assay
IC50 14000±n/a nM
Citation Johannes, JWHande, SMDegorce, SLPacker, MJ Chemical compounds US Patent US11325906 Publication Date 5/10/2022
 
Protein mono-ADP-ribosyltransferase PARP6
Name:Protein mono-ADP-ribosyltransferase PARP6
Type:PROTEIN
Mol. Mass.:71130.07
Organism:Homo sapiens (Human)
Description:ChEMBL_107589
Residue:630
BDBM553966
NameBDBM553966
Synonyms:US11325906, Example 29
TypeSmall organic molecule
Emp. Form.C23H26F2N6O2
Mol. Mass.456.4883
SMILESCCc1cc2ncc(CN3CCN(CC3)c3ccc(nc3C(F)F)C(=O)NC)cc2[nH]c1=O