Reaction Details
TargetSerine/threonine-protein kinase B-raf
LigandBDBM435718
Substrate/Competitorn/a
Meas. Tech.Kinase Hotspot Assay
IC50<0.040±n/a nM
Citation Mahmoud, GEChoi, HSYoo, KHHan, DKOh, CHMohammed, AMohammed, IEAmmar, UM Imidazooxazole derivative having antitumor effect, and pharmaceutical composition including same US Patent US11332479 Publication Date 5/17/2022
 
Serine/threonine-protein kinase B-raf
Name:Serine/threonine-protein kinase B-raf
Type:Serine/threonine-protein kinase
Mol. Mass.:84446.00
Organism:Homo sapiens (Human)
Description:P15056
Residue:766
BDBM435718
NameBDBM435718
Synonyms:US10570155, Compound 2II | US11332479, Compound 2II
TypeSmall organic molecule
Emp. Form.C21H23N7O4S
Mol. Mass.469.517
SMILESCCN1CCN(CCNc2nccc(n2)-c2c(nc3occn23)-c2cccc(O)c2)S1(=O)=O