Reaction Details
TargetPlasma kallikrein
LigandBDBM306546
Substrate/Competitorn/a
Meas. Tech.In Vitro Plasma Kallikrein Inhibition Assay
IC50 4.57±n/a nM
Citation Li, ZZancanella, MYu, CSetti, LQSham, HXu, QYee, CWYu, M Bridged bicyclic kallikrein inhibitors US Patent US10144746 Publication Date 12/4/2018
 
Plasma kallikrein
Name:Plasma kallikrein
Type:Protein
Mol. Mass.:71391.16
Organism:Homo sapiens (Human)
Description:P03952
Residue:638
BDBM306546
NameBDBM306546
Synonyms:(+-)-N-[(4-carbamimidoylphenyl) methyl]-12-phenyl-15- oxatetracyclo[6.6.1.02,7.09,14]- pentadeca-2,4,6,9,11,13- hexaene-4-carboxamide | US10144746, Compound 189
TypeSmall organic molecule
Emp. Form.C29H23N3O2
Mol. Mass.445.5118
SMILESNC(=N)c1ccc(CNC(=O)c2ccc3C4OC(c3c2)c2cc(ccc42)-c2ccccc2)cc1