Reaction Details
TargetPlasma kallikrein
LigandBDBM306647
Substrate/Competitorn/a
Meas. Tech.In Vitro Plasma Kallikrein Inhibition Assay
IC50 1.000±n/a nM
Citation Li, ZZancanella, MYu, CSetti, LQSham, HXu, QYee, CWYu, M Bridged bicyclic kallikrein inhibitors US Patent US10144746 Publication Date 12/4/2018
 
Plasma kallikrein
Name:Plasma kallikrein
Type:Protein
Mol. Mass.:71391.16
Organism:Homo sapiens (Human)
Description:P03952
Residue:638
BDBM306647
NameBDBM306647
Synonyms:(1R,8S)-N-[(4-carbamimidoyl- 2-fluorophenyl)-methyl]-12- (2-fluorophenyl)-15- oxatetracyclo [6.6.1.02,7.09,14]pentadeca- 2,4,6,9,11,13-hexaene-4- carboxamide | US10144746, Compound 290
TypeSmall organic molecule
Emp. Form.C29H21F2N3O2
Mol. Mass.481.4927
SMILESNC(=N)c1ccc(CNC(=O)c2ccc3[C@H]4O[C@@H](c3c2)c2cc(ccc42)-c2ccccc2F)c(F)c1