Reaction Details
TargetPlasma kallikrein
LigandBDBM306652
Substrate/Competitorn/a
Meas. Tech.In Vitro Plasma Kallikrein Inhibition Assay
IC50 1.000±n/a nM
Citation Li, ZZancanella, MYu, CSetti, LQSham, HXu, QYee, CWYu, M Bridged bicyclic kallikrein inhibitors US Patent US10144746 Publication Date 12/4/2018
 
Plasma kallikrein
Name:Plasma kallikrein
Type:Protein
Mol. Mass.:71391.16
Organism:Homo sapiens (Human)
Description:P03952
Residue:638
BDBM306652
NameBDBM306652
Synonyms:(1R,8S)-N-((4-carbamimidoyl- 2,6-difluorophenyl)methyl]- 12-(3,3,3-trifluoropropyl)-15- oxatetracyclo[6.6.1.02,7.09,14] pentadeca-2,4,6,9,11,13- hexaene-4-carboxamide | US10144746, Compound 296
TypeSmall organic molecule
Emp. Form.C26H20F5N3O2
Mol. Mass.501.4479
SMILESNC(=N)c1cc(F)c(CNC(=O)c2ccc3[C@H]4O[C@H](c5cc(CCC(F)(F)F)ccc45)c3c2)c(F)c1