Reaction Details
TargetPlasma kallikrein
LigandBDBM306686
Substrate/Competitorn/a
Meas. Tech.In Vitro Plasma Kallikrein Inhibition Assay
IC50 1.000±n/a nM
Citation Li, ZZancanella, MYu, CSetti, LQSham, HXu, QYee, CWYu, M Bridged bicyclic kallikrein inhibitors US Patent US10144746 Publication Date 12/4/2018
 
Plasma kallikrein
Name:Plasma kallikrein
Type:Protein
Mol. Mass.:71391.16
Organism:Homo sapiens (Human)
Description:P03952
Residue:638
BDBM306686
NameBDBM306686
Synonyms:(1R,8S)-N-[(4-carbamimidoyl- 2,6-dimethyl-phenyl)methyl]- 12-cyclopropyl-15-oxatetracyclo [6.6.1.02,7.09,14]pentadeca- 2,4,6,9,11,13-hexaene-4- carboxamide | US10144746, Compound 331
TypeSmall organic molecule
Emp. Form.C28H27N3O2
Mol. Mass.437.5329
SMILESCc1cc(cc(C)c1CNC(=O)c1ccc2[C@H]3O[C@H](c4cc(ccc34)C3CC3)c2c1)C(N)=N