Reaction Details
TargetVasopressin V1b receptor
LigandBDBM175039
Substrate/Competitorn/a
Meas. Tech.Binding Assay
pH7.4±n/a
Temperature298.15±n/a K
Ki<1.00±n/a nM
Commentsextracted
Citation Geneste, HHornberger, WJantos, KKling, AVan Gaalen, M Oxindole compounds carrying a nitrogen-bound spiro substituent and use thereof for treating vasopressin-related diseases US Patent US9688678 Publication Date 6/27/2017
 
Vasopressin V1b receptor
Name:Vasopressin V1b receptor
Type:Enzyme
Mol. Mass.:46985.01
Organism:Homo sapiens (Human)
Description:P47901
Residue:424
BDBM175039
NameBDBM175039
Synonyms:US9688678, 11 (+)-3-(2-ethoxy-5-methoxyphenyl)-1-((5-methoxypyridin-2-yl)sulfonyl)-3-(6-(1-(oxetan-3-yl)piperidin-4-yl)-2,6-diazaspiro[3.3]heptan-2-yl)-2-oxoindoline-5-carbonitrile
TypeSmall organic molecule
Emp. Form.C37H44N6O7S
Mol. Mass.716.846
SMILESCCOc1ccc(OC)c(c1)C1(C2C=C(C=CC2N(C1=O)S(=O)(=O)c1ccc(OC)cn1)C#N)N1CC2(CN(C2)C2CCN(CC2)C2COC2)C1