Reaction Details
TargetVasopressin V1b receptor
LigandBDBM175060
Substrate/Competitorn/a
Meas. Tech.Binding Assay
pH7.4±n/a
Temperature298.15±n/a K
Ki<1.00±n/a nM
Commentsextracted
Citation Geneste, HHornberger, WJantos, KKling, AVan Gaalen, M Oxindole compounds carrying a nitrogen-bound spiro substituent and use thereof for treating vasopressin-related diseases US Patent US9688678 Publication Date 6/27/2017
 
Vasopressin V1b receptor
Name:Vasopressin V1b receptor
Type:Enzyme
Mol. Mass.:46985.01
Organism:Homo sapiens (Human)
Description:P47901
Residue:424
BDBM175060
NameBDBM175060
Synonyms:US9688678, 21 (+-)-3-(2,5-dimethoxyphenyl)-1-[(5-methoxy-2-pyridyl)sulfonyl]-3-[2-(1-methyl-4-piperidyl)-2,6-diazaspiro[3.3]heptan-6-yl]-2-oxo-indoline-5-carbonitrile
TypeSmall organic molecule
Emp. Form.C34H40N6O6S
Mol. Mass.660.783
SMILESCOc1ccc(nc1)S(=O)(=O)N1C2C=CC(=CC2C(N2CC3(CN(C3)C3CCN(C)CC3)C2)(C1=O)c1cc(OC)ccc1OC)C#N