Reaction Details
TargetAcetyl-CoA carboxylase 2
LigandBDBM306906
Substrate/Competitorn/a
Meas. Tech.Inhibitory Activity on Human ACC1 and the ACC2
IC50 4.00±n/a nM
Citation Kobayashi, NAsahi, KTomida, YOhdan, MFumoto, MSasaki, YKurahashi, KInoue, TUrabe, TNishiura, YIwatsu, MMiyazaki, KOhyabu, NWada, TKatou, M Alkylene derivatives US Patent US10150728 Publication Date 12/11/2018
 
Acetyl-CoA carboxylase 2
Name:Acetyl-CoA carboxylase 2
Type:Protein
Mol. Mass.:276535.21
Organism:Homo sapiens (Human)
Description:O00763
Residue:2458
BDBM306906
NameBDBM306906
Synonyms:US10150728, Example I-119
TypeSmall organic molecule
Emp. Form.C22H29FN2O4S
Mol. Mass.436.54
SMILESC[C@@H](CO[C@H]1CC[C@@H](CC1)Oc1ccc2nc(OCC3CC3)sc2c1F)NC(C)=O