Reaction Details
TargetAcetyl-CoA carboxylase 2
LigandBDBM306965
Substrate/Competitorn/a
Meas. Tech.Inhibitory Activity on Human ACC1 and the ACC2
IC50 3.00±n/a nM
Citation Kobayashi, NAsahi, KTomida, YOhdan, MFumoto, MSasaki, YKurahashi, KInoue, TUrabe, TNishiura, YIwatsu, MMiyazaki, KOhyabu, NWada, TKatou, M Alkylene derivatives US Patent US10150728 Publication Date 12/11/2018
 
Acetyl-CoA carboxylase 2
Name:Acetyl-CoA carboxylase 2
Type:Protein
Mol. Mass.:276535.21
Organism:Homo sapiens (Human)
Description:O00763
Residue:2458
BDBM306965
NameBDBM306965
Synonyms:US10150728, Example I-178
TypeSmall organic molecule
Emp. Form.C19H27N3O4S
Mol. Mass.393.5
SMILESCCOc1nc2ccc(O[C@H]3CC[C@@H](CC3)OC[C@H](C)NC(C)=O)nc2s1