Reaction Details
TargetAcetyl-CoA carboxylase 2
LigandBDBM307032
Substrate/Competitorn/a
Meas. Tech.Inhibitory Activity on Human ACC1 and the ACC2
IC50 4.00±n/a nM
Citation Kobayashi, NAsahi, KTomida, YOhdan, MFumoto, MSasaki, YKurahashi, KInoue, TUrabe, TNishiura, YIwatsu, MMiyazaki, KOhyabu, NWada, TKatou, M Alkylene derivatives US Patent US10150728 Publication Date 12/11/2018
 
Acetyl-CoA carboxylase 2
Name:Acetyl-CoA carboxylase 2
Type:Protein
Mol. Mass.:276535.21
Organism:Homo sapiens (Human)
Description:O00763
Residue:2458
BDBM307032
NameBDBM307032
Synonyms:US10150728, Example I-245
TypeSmall organic molecule
Emp. Form.C20H27N3O4S
Mol. Mass.405.511
SMILESC[C@@H](CO[C@H]1C[C@H](COc2ccc3nc(OC4CCC4)sc3n2)C1)NC(C)=O