Reaction Details
TargetAcetyl-CoA carboxylase 2
LigandBDBM307330
Substrate/Competitorn/a
Meas. Tech.Inhibitory Activity on Human ACC1 and the ACC2
IC50 4.00±n/a nM
Citation Kobayashi, NAsahi, KTomida, YOhdan, MFumoto, MSasaki, YKurahashi, KInoue, TUrabe, TNishiura, YIwatsu, MMiyazaki, KOhyabu, NWada, TKatou, M Alkylene derivatives US Patent US10150728 Publication Date 12/11/2018
 
Acetyl-CoA carboxylase 2
Name:Acetyl-CoA carboxylase 2
Type:Protein
Mol. Mass.:276535.21
Organism:Homo sapiens (Human)
Description:O00763
Residue:2458
BDBM307330
NameBDBM307330
Synonyms:US10150728, Example I-544
TypeSmall organic molecule
Emp. Form.C21H26ClFN4O2
Mol. Mass.420.908
SMILESC[C@@H](CC[C@H]1CC[C@@H](CC1)Oc1ncc(cc1F)-c1ncc(Cl)cn1)NC(C)=O