Reaction Details
TargetAcetyl-CoA carboxylase 2
LigandBDBM307421
Substrate/Competitorn/a
Meas. Tech.Inhibitory Activity on Human ACC1 and the ACC2
IC50 4.00±n/a nM
Citation Kobayashi, NAsahi, KTomida, YOhdan, MFumoto, MSasaki, YKurahashi, KInoue, TUrabe, TNishiura, YIwatsu, MMiyazaki, KOhyabu, NWada, TKatou, M Alkylene derivatives US Patent US10150728 Publication Date 12/11/2018
 
Acetyl-CoA carboxylase 2
Name:Acetyl-CoA carboxylase 2
Type:Protein
Mol. Mass.:276535.21
Organism:Homo sapiens (Human)
Description:O00763
Residue:2458
BDBM307421
NameBDBM307421
Synonyms:US10150728, Example I-651
TypeSmall organic molecule
Emp. Form.C21H29ClFN3O4
Mol. Mass.441.924
SMILESCCOc1cc(Cl)c2nc(O[C@H]3CC[C@@H](CC3)OC[C@H](C)NC(C)=O)n(C)c2c1F