Reaction Details
TargetAcetyl-CoA carboxylase 2
LigandBDBM307430
Substrate/Competitorn/a
Meas. Tech.Inhibitory Activity on Human ACC1 and the ACC2
IC50 5.00±n/a nM
Citation Kobayashi, NAsahi, KTomida, YOhdan, MFumoto, MSasaki, YKurahashi, KInoue, TUrabe, TNishiura, YIwatsu, MMiyazaki, KOhyabu, NWada, TKatou, M Alkylene derivatives US Patent US10150728 Publication Date 12/11/2018
 
Acetyl-CoA carboxylase 2
Name:Acetyl-CoA carboxylase 2
Type:Protein
Mol. Mass.:276535.21
Organism:Homo sapiens (Human)
Description:O00763
Residue:2458
BDBM307430
NameBDBM307430
Synonyms:US10150728, Example I-662
TypeSmall organic molecule
Emp. Form.C22H31ClN4O4
Mol. Mass.450.959
SMILESC[C@@H](CO[C@H]1CC[C@@H](CC1)Oc1nc2cnc(OCC3CC3)c(Cl)c2n1C)NC(C)=O