Reaction Details
TargetAcetyl-CoA carboxylase 2
LigandBDBM307449
Substrate/Competitorn/a
Meas. Tech.Inhibitory Activity on Human ACC1 and the ACC2
IC50 3.00±n/a nM
Citation Kobayashi, NAsahi, KTomida, YOhdan, MFumoto, MSasaki, YKurahashi, KInoue, TUrabe, TNishiura, YIwatsu, MMiyazaki, KOhyabu, NWada, TKatou, M Alkylene derivatives US Patent US10150728 Publication Date 12/11/2018
 
Acetyl-CoA carboxylase 2
Name:Acetyl-CoA carboxylase 2
Type:Protein
Mol. Mass.:276535.21
Organism:Homo sapiens (Human)
Description:O00763
Residue:2458
BDBM307449
NameBDBM307449
Synonyms:US10150728, Example I-683
TypeSmall organic molecule
Emp. Form.C22H27F4N3O4
Mol. Mass.473.4611
SMILESC[C@@H](CO[C@H]1CC[C@@H](CC1)Oc1nc2c(F)cc(OC3CC3)c(F)c2n1C)NC(=O)C(F)F