Reaction Details
TargetTransient receptor potential cation channel subfamily M member 8
LigandBDBM50318482
Substrate/Competitorn/a
Meas. Tech.TRPM8 receptor assay
EC50 3800±n/a nM
Citation Wei, ET Treatment of upper aerodigestive tract disorders and cough US Patent US11406649 Publication Date 8/9/2022
 
Transient receptor potential cation channel subfamily M member 8
Name:Transient receptor potential cation channel subfamily M member 8
Type:Enzyme
Mol. Mass.:127693.26
Organism:Homo sapiens (Human)
Description:Q7Z2W7
Residue:1104
BDBM50318482
NameBDBM50318482
Synonyms:(-)-menthol MENTHOL l-menthol
TypeSmall organic molecule
Emp. Form.C10H20O
Mol. Mass.156.2652
SMILESCC(C)[C@@H]1CC[C@@H](C)C[C@H]1O