Reaction Details
TargetUDP-3-O-acyl-N-acetylglucosamine deacetylase
LigandBDBM563125
Substrate/Competitorn/a
Meas. Tech.LpxC Binding Assay
IC50 30±n/a nM
Citation Teng, MNammalwar, BLi, XPerez, CYule, IFaulkner, AAtton, HParkes, AConvers-Reignier, SSouthey, MPuerta, DT Antibacterial compounds US Patent US11407740 Publication Date 8/9/2022
 
UDP-3-O-acyl-N-acetylglucosamine deacetylase
Name:UDP-3-O-acyl-N-acetylglucosamine deacetylase
Type:Enzyme
Mol. Mass.:33952.00
Organism:Escherichia coli
Description:P0A725
Residue:305
BDBM563125
NameBDBM563125
Synonyms:US11407740, Compound 14
TypeSmall organic molecule
Emp. Form.C29H33FN4O3
Mol. Mass.504.5957
SMILESC[C@@H](CF)NCC(Cc1nc[nH]c(=O)c1O)c1ccc(cc1)C#Cc1ccc(CN2CCOCC2)cc1