Reaction Details
TargetUDP-3-O-acyl-N-acetylglucosamine deacetylase
LigandBDBM563146
Substrate/Competitorn/a
Meas. Tech.LpxC Binding Assay
IC50<10±n/a nM
Citation Teng, MNammalwar, BLi, XPerez, CYule, IFaulkner, AAtton, HParkes, AConvers-Reignier, SSouthey, MPuerta, DT Antibacterial compounds US Patent US11407740 Publication Date 8/9/2022
 
UDP-3-O-acyl-N-acetylglucosamine deacetylase
Name:UDP-3-O-acyl-N-acetylglucosamine deacetylase
Type:Enzyme
Mol. Mass.:33952.00
Organism:Escherichia coli
Description:P0A725
Residue:305
BDBM563146
NameBDBM563146
Synonyms:US11407740, Compound 19 | US11407740, Compound 20
TypeSmall organic molecule
Emp. Form.C28H29FN4O4
Mol. Mass.504.5527
SMILESOc1c(CC(C(=O)NCCF)c2ccc(cc2)C#Cc2ccc(CN3CCOCC3)cc2)nc[nH]c1=O