Reaction Details
TargetUDP-3-O-acyl-N-acetylglucosamine deacetylase
LigandBDBM563152
Substrate/Competitorn/a
Meas. Tech.LpxC Binding Assay
IC50 30±n/a nM
Citation Teng, MNammalwar, BLi, XPerez, CYule, IFaulkner, AAtton, HParkes, AConvers-Reignier, SSouthey, MPuerta, DT Antibacterial compounds US Patent US11407740 Publication Date 8/9/2022
 
UDP-3-O-acyl-N-acetylglucosamine deacetylase
Name:UDP-3-O-acyl-N-acetylglucosamine deacetylase
Type:Enzyme
Mol. Mass.:33952.00
Organism:Escherichia coli
Description:P0A725
Residue:305
BDBM563152
NameBDBM563152
Synonyms:US11407740, Compound 23
TypeSmall organic molecule
Emp. Form.C27H28N4O4
Mol. Mass.472.5356
SMILESCNC(=O)C(Cc1nc[nH]c(=O)c1O)c1ccc(cc1)C#Cc1ccc(CN2CCOCC2)cc1