Reaction Details
TargetUDP-3-O-acyl-N-acetylglucosamine deacetylase
LigandBDBM563256
Substrate/Competitorn/a
Meas. Tech.LpxC Binding Assay
IC50 30±n/a nM
Citation Teng, MNammalwar, BLi, XPerez, CYule, IFaulkner, AAtton, HParkes, AConvers-Reignier, SSouthey, MPuerta, DT Antibacterial compounds US Patent US11407740 Publication Date 8/9/2022
 
UDP-3-O-acyl-N-acetylglucosamine deacetylase
Name:UDP-3-O-acyl-N-acetylglucosamine deacetylase
Type:Enzyme
Mol. Mass.:33952.00
Organism:Escherichia coli
Description:P0A725
Residue:305
BDBM563256
NameBDBM563256
Synonyms:6-(3-(((S)-1-fluoropropan-2-yl)amino)-2-(4-((4-((3-methoxyazetidin-1-yl)methyl)phenyl)ethynyl)phenyl)propyl)-5-hydroxypyrimidin-4(3H)-one | US11407740, Compound 68
TypeSmall organic molecule
Emp. Form.C29H33FN4O3
Mol. Mass.504.5957
SMILESCOC1CN(Cc2ccc(cc2)C#Cc2ccc(cc2)C(CN[C@@H](C)CF)Cc2nc[nH]c(=O)c2O)C1