Reaction Details
TargetUDP-3-O-acyl-N-acetylglucosamine deacetylase
LigandBDBM563271
Substrate/Competitorn/a
Meas. Tech.LpxC Binding Assay
IC50 30±n/a nM
Citation Teng, MNammalwar, BLi, XPerez, CYule, IFaulkner, AAtton, HParkes, AConvers-Reignier, SSouthey, MPuerta, DT Antibacterial compounds US Patent US11407740 Publication Date 8/9/2022
 
UDP-3-O-acyl-N-acetylglucosamine deacetylase
Name:UDP-3-O-acyl-N-acetylglucosamine deacetylase
Type:Enzyme
Mol. Mass.:33952.00
Organism:Escherichia coli
Description:P0A725
Residue:305
BDBM563271
NameBDBM563271
Synonyms:US11407740, Compound 174
TypeSmall organic molecule
Emp. Form.C27H30N4O3
Mol. Mass.458.5521
SMILESCOC1CCN(Cc2ccc(cc2)C#Cc2ccc(cc2)C(N)Cc2nc[nH]c(=O)c2O)CC1