Reaction Details
TargetUDP-3-O-acyl-N-acetylglucosamine deacetylase
LigandBDBM563275
Substrate/Competitorn/a
Meas. Tech.LpxC Binding Assay
IC50<10±n/a nM
Citation Teng, MNammalwar, BLi, XPerez, CYule, IFaulkner, AAtton, HParkes, AConvers-Reignier, SSouthey, MPuerta, DT Antibacterial compounds US Patent US11407740 Publication Date 8/9/2022
 
UDP-3-O-acyl-N-acetylglucosamine deacetylase
Name:UDP-3-O-acyl-N-acetylglucosamine deacetylase
Type:Enzyme
Mol. Mass.:33952.00
Organism:Escherichia coli
Description:P0A725
Residue:305
BDBM563275
NameBDBM563275
Synonyms:US11407740, Compound 193
TypeSmall organic molecule
Emp. Form.C26H27N5O5
Mol. Mass.489.5231
SMILESOCC(Cc1nc[nH]c(=O)c1O)N1Cc2cc(cn2C1=O)C#Cc1ccc(CN2CCOCC2)cc1