Reaction Details
TargetUDP-3-O-acyl-N-acetylglucosamine deacetylase
LigandBDBM563289
Substrate/Competitorn/a
Meas. Tech.LpxC Binding Assay
IC50<10±n/a nM
Citation Teng, MNammalwar, BLi, XPerez, CYule, IFaulkner, AAtton, HParkes, AConvers-Reignier, SSouthey, MPuerta, DT Antibacterial compounds US Patent US11407740 Publication Date 8/9/2022
 
UDP-3-O-acyl-N-acetylglucosamine deacetylase
Name:UDP-3-O-acyl-N-acetylglucosamine deacetylase
Type:Enzyme
Mol. Mass.:33952.00
Organism:Escherichia coli
Description:P0A725
Residue:305
BDBM563289
NameBDBM563289
Synonyms:US11407740, Compound 240 US11407740, Compound 242
TypeSmall organic molecule
Emp. Form.C29H32N4O5
Mol. Mass.516.5882
SMILESOCC(Cc1nc[nH]c(=O)c1O)c1ccc(cc1)C#Cc1ccc(CN2CCC(CC2)NC(=O)CO)cc1