Reaction Details
TargetUDP-3-O-acyl-N-acetylglucosamine deacetylase
LigandBDBM563298
Substrate/Competitorn/a
Meas. Tech.LpxC Binding Assay
IC50<10±n/a nM
Citation Teng, MNammalwar, BLi, XPerez, CYule, IFaulkner, AAtton, HParkes, AConvers-Reignier, SSouthey, MPuerta, DT Antibacterial compounds US Patent US11407740 Publication Date 8/9/2022
 
UDP-3-O-acyl-N-acetylglucosamine deacetylase
Name:UDP-3-O-acyl-N-acetylglucosamine deacetylase
Type:Enzyme
Mol. Mass.:33952.00
Organism:Escherichia coli
Description:P0A725
Residue:305
BDBM563298
NameBDBM563298
Synonyms:US11407740, Compound 299
TypeSmall organic molecule
Emp. Form.C26H28N4O5S
Mol. Mass.508.589
SMILESCOC1CN(Cc2ccc(cc2)C#Cc2ccc(cc2)[C@@H](Cc2nc[nH]c(=O)c2O)NS(C)(=O)=O)C1