Reaction Details
TargetGenome polyprotein
LigandBDBM307542
Substrate/Competitorn/a
Meas. Tech.HCV Replicon Luciferase Assay
IC50 0.603±n/a nM
Citation Yeung, KKadow, JFBora, ROAnjanappa, PGupta, SV Compounds for the treatment of hepatitis C US Patent US10150747 Publication Date 12/11/2018
 
Genome polyprotein
Name:Genome polyprotein
Type:Enzyme
Mol. Mass.:326966.11
Organism:Hepatitis C virus (HCV)
Description:Q9WMX2
Residue:3010
BDBM307542
NameBDBM307542
Synonyms:5-(3-((2-(1,2,4-Oxadiazol-3-yl)propan-2-yl)carbamoyl)-4-methoxyphenyl)-6-ethoxy-2-(4-fluorophenyl)-N-methylbenzofuran-3-carboxamide US10150747, Example 9
TypeSmall organic molecule
Emp. Form.C31H29FN4O6
Mol. Mass.572.5836
SMILESCCOc1cc2oc(c(C(=O)NC)c2cc1-c1ccc(OC)c(c1)C(=O)NC(C)(C)c1ncon1)-c1ccc(F)cc1