Reaction Details
TargetGenome polyprotein
LigandBDBM307539
Substrate/Competitorn/a
Meas. Tech.HCV Replicon Luciferase Assay
IC50 5.05±n/a nM
Citation Yeung, KKadow, JFBora, ROAnjanappa, PGupta, SV Compounds for the treatment of hepatitis C US Patent US10150747 Publication Date 12/11/2018
 
Genome polyprotein
Name:Genome polyprotein
Type:Enzyme
Mol. Mass.:326966.11
Organism:Hepatitis C virus (HCV)
Description:Q9WMX2
Residue:3010
BDBM307539
NameBDBM307539
Synonyms:5-(3-((2-(1,2,4-Oxadiazol-3-yl)propan-2-yl)carbamoyl)phenyl)-6-ethoxy-2-(4-fluorophenyl)-N-methylbenzofuran-3-carboxamide US10150747, Example 6
TypeSmall organic molecule
Emp. Form.C30H27FN4O5
Mol. Mass.542.5576
SMILESCCOc1cc2oc(c(C(=O)NC)c2cc1-c1cccc(c1)C(=O)NC(C)(C)c1ncon1)-c1ccc(F)cc1