Reaction Details
TargetGenome polyprotein
LigandBDBM307558
Substrate/Competitorn/a
Meas. Tech.HCV Replicon Luciferase Assay
EC50 6.23±n/a nM
Citation Yeung, KKadow, JFBora, ROAnjanappa, PGupta, SV Compounds for the treatment of hepatitis C US Patent US10150747 Publication Date 12/11/2018
 
Genome polyprotein
Name:Genome polyprotein
Type:Enzyme
Mol. Mass.:326966.11
Organism:Hepatitis C virus (HCV)
Description:Q9WMX2
Residue:3010
BDBM307558
NameBDBM307558
Synonyms:5-(3-((2-(1,2,4-oxadiazol-3-yl)propan-2-yl)carbamoyl)-4-methoxyphenyl)-2-(4-fluorophenyl)-N-methyl-6-propoxybenzofuran-3-carboxamide | US10150747, Example 25
TypeSmall organic molecule
Emp. Form.C32H31FN4O6
Mol. Mass.586.6101
SMILESCCCOc1cc2oc(c(C(=O)NC)c2cc1-c1ccc(OC)c(c1)C(=O)NC(C)(C)c1ncon1)-c1ccc(F)cc1