Reaction Details
TargetInhibitor of nuclear factor kappa-B kinase subunit beta
LigandBDBM569251
Substrate/Competitorn/a
Meas. Tech.ROCK Kinase Inhibition Assays
IC50 0.600±n/a nM
Citation deLong, MASturdivant, JMLichorowic, CLKornilov, A Aryl cyclopropyl-amino-isoquinolinyl amide compounds US Patent US11427563 Publication Date 8/30/2022
 
Inhibitor of nuclear factor kappa-B kinase subunit beta
Name:Inhibitor of nuclear factor kappa-B kinase subunit beta
Type:Serine/threonine-protein kinase
Mol. Mass.:86554.39
Organism:Homo sapiens (Human)
Description:GST-tagged IKK-2 was expressed in High Five cells and purified.
Residue:756
BDBM569251
NameBDBM569251
Synonyms:US11427563, Compound 118 | US11427563, Compound 120
TypeSmall organic molecule
Emp. Form.C24H20N4O3S
Mol. Mass.444.506
SMILESO=C(Nc1ccc2cnccc2c1)[C@@H]1CC1c1ccc(cc1)S(=O)(=O)Nc1ccccn1