Reaction Details
TargetInhibitor of nuclear factor kappa-B kinase subunit beta
LigandBDBM569268
Substrate/Competitorn/a
Meas. Tech.ROCK Kinase Inhibition Assays
IC50 3.60±n/a nM
Citation deLong, MASturdivant, JMLichorowic, CLKornilov, A Aryl cyclopropyl-amino-isoquinolinyl amide compounds US Patent US11427563 Publication Date 8/30/2022
 
Inhibitor of nuclear factor kappa-B kinase subunit beta
Name:Inhibitor of nuclear factor kappa-B kinase subunit beta
Type:Serine/threonine-protein kinase
Mol. Mass.:86554.39
Organism:Homo sapiens (Human)
Description:GST-tagged IKK-2 was expressed in High Five cells and purified.
Residue:756
BDBM569268
NameBDBM569268
Synonyms:US11427563, Compound 141 US11427563, Compound 85
TypeSmall organic molecule
Emp. Form.C25H23N5O3S
Mol. Mass.473.547
SMILESCCc1cncc2ccc(NC(=O)[C@@H]3CC3c3ccc(cc3)S(=O)(=O)Nc3ncccn3)cc12