Reaction Details
TargetEnoyl-[acyl-carrier-protein] reductase [NADH] FabI
LigandBDBM8776
Substrate/CompetitorBDBM8737
Meas. Tech.Enzyme Inhibition Assay
Temperature303.15±n/a K
IC50 5200±n/a nM
Commentsextracted
Citation Seefeld, MAMiller, WHNewlander, KABurgess, WJPayne, DJRittenhouse, SFMoore, TDDeWolf, WEKeller, PMQiu, XJanson, CAVaidya, KFosberry, APSmyth, MGJaworski, DDSlater-Radosti, CHuffman, WF Inhibitors of bacterial enoyl acyl carrier protein reductase (FabI): 2,9-disubstituted 1,2,3,4-tetrahydropyrido[3,4-b]indoles as potential antibacterial agents. Bioorg Med Chem Lett11:2241-4 (2001) 
 
Enoyl-[acyl-carrier-protein] reductase [NADH] FabI
Name:Enoyl-[acyl-carrier-protein] reductase [NADH] FabI
Type:Enzyme
Mol. Mass.:27861.12
Organism:Escherichia coli
Description:n/a
Residue:262
BDBM8776
BDBM8737
NameBDBM8776
Synonyms:1,2,3,4-tetrahydro pyrido[3,4-b]indole 20 | 4-({2-[(4-methylphenyl)carbonyl]-1H,2H,3H,4H,9H-pyrido[3,4-b]indol-9-yl}methyl)phenol
TypeSmall organic molecule
Emp. Form.C26H24N2O2
Mol. Mass.396.481
SMILESCc1ccc(cc1)C(=O)N1CCc2c(C1)n(Cc1ccc(O)cc1)c1ccccc21