Reaction Details
TargetP2X purinoceptor 7
LigandBDBM173652
Substrate/Competitorn/a
Meas. Tech.In Vitro Assay
IC50 1.20±n/a nM
Citation Kilburn, JPRasmussen, LKJessing, MEldemenky, EMChen, BJiang, YHopper, AT Benzamide-containing compounds and their use in the treatment of pain US Patent US9649308 Publication Date 5/16/2017
 
P2X purinoceptor 7
Name:P2X purinoceptor 7
Type:Protein
Mol. Mass.:68602.85
Organism:Homo sapiens (Human)
Description:Q99572
Residue:595
BDBM173652
NameBDBM173652
Synonyms:US9102591, 2-chloro-N-[[4,4-difluoro-1-(6-fluoro-3-pyridyl)cyclohexyl]methyl]-5-(trifluoromethyl)benzamide | US9649308, 2-chloro-N-[[4,4-difluoro-1-(6-fluoro-3-pyridyl)cyclohexyl]methyl]-5-(trifluoromethyl)benzamide
TypeSmall organic molecule
Emp. Form.C20H17ClF6N2O
Mol. Mass.450.805
SMILESFc1ccc(cn1)C1(CNC(=O)c2cc(ccc2Cl)C(F)(F)F)CCC(F)(F)CC1