Reaction Details
TargetP2X purinoceptor 7
LigandBDBM173661
Substrate/Competitorn/a
Meas. Tech.In Vitro Assay
IC50 0.83±n/a nM
Citation Kilburn, JPRasmussen, LKJessing, MEldemenky, EMChen, BJiang, YHopper, AT Benzamide-containing compounds and their use in the treatment of pain US Patent US9649308 Publication Date 5/16/2017
 
P2X purinoceptor 7
Name:P2X purinoceptor 7
Type:Protein
Mol. Mass.:68602.85
Organism:Homo sapiens (Human)
Description:Q99572
Residue:595
BDBM173661
NameBDBM173661
Synonyms:US9102591, 2-chloro-N-((4,4-difluoro-1-(6-fluoropyridin-3-yl)cyclohexyl)methyl)-5-methoxybenzamide | US9649308, 2-chloro-N-((4,4-difluoro-1-(6-fluoropyridin-3-yl)cyclohexyl)methyl)-5-methoxybenzamide
TypeSmall organic molecule
Emp. Form.C20H20ClF3N2O2
Mol. Mass.412.833
SMILESCOc1ccc(Cl)c(c1)C(=O)NCC1(CCC(F)(F)CC1)c1ccc(F)nc1