Reaction Details
TargetP2X purinoceptor 7
LigandBDBM173665
Substrate/Competitorn/a
Meas. Tech.In Vitro Assay
IC50 1.20±n/a nM
Citation Kilburn, JPRasmussen, LKJessing, MEldemenky, EMChen, BJiang, YHopper, AT Benzamide-containing compounds and their use in the treatment of pain US Patent US9649308 Publication Date 5/16/2017
 
P2X purinoceptor 7
Name:P2X purinoceptor 7
Type:Protein
Mol. Mass.:68602.85
Organism:Homo sapiens (Human)
Description:Q99572
Residue:595
BDBM173665
NameBDBM173665
Synonyms:US9102591, 2,3-dichloro-N-((4,4-difluoro-1-(6-(trifluoromethyl)pyridin-3-yl)cyclohexyl)methyl)benzamide | US9649308, 2,3-dichloro-N-((4,4-difluoro-1-(6-(trifluoromethyl)pyridin-3-yl)cyclohexyl)methyl)benzamide
TypeSmall organic molecule
Emp. Form.C20H17Cl2F5N2O
Mol. Mass.467.26
SMILESFC(F)(F)c1ccc(cn1)C1(CNC(=O)c2cccc(Cl)c2Cl)CCC(F)(F)CC1