Reaction Details
TargetP2X purinoceptor 7
LigandBDBM173668
Substrate/Competitorn/a
Meas. Tech.In Vitro Assay
IC50 0.96±n/a nM
Citation Kilburn, JPRasmussen, LKJessing, MEldemenky, EMChen, BJiang, YHopper, AT Benzamide-containing compounds and their use in the treatment of pain US Patent US9649308 Publication Date 5/16/2017
 
P2X purinoceptor 7
Name:P2X purinoceptor 7
Type:Protein
Mol. Mass.:68602.85
Organism:Homo sapiens (Human)
Description:Q99572
Residue:595
BDBM173668
NameBDBM173668
Synonyms:US9102591, 2,3-dichloro-N-((4,4-difluoro-1-(6-methoxypyridin-3-yl)cyclohexyl)methyl)benzamide | US9649308, 2,3-dichloro-N-((4,4-difluoro-1-(6-methoxypyridin-3-yl)cyclohexyl)methyl)benzamide
TypeSmall organic molecule
Emp. Form.C20H20Cl2F2N2O2
Mol. Mass.429.288
SMILESCOc1ccc(cn1)C1(CNC(=O)c2cccc(Cl)c2Cl)CCC(F)(F)CC1