Reaction Details
TargetP2X purinoceptor 7
LigandBDBM173826
Substrate/Competitorn/a
Meas. Tech.In Vitro Assay
IC50 1.20±n/a nM
Citation Kilburn, JPRasmussen, LKJessing, MEldemenky, EMChen, BJiang, YHopper, AT Benzamide-containing compounds and their use in the treatment of pain US Patent US9649308 Publication Date 5/16/2017
 
P2X purinoceptor 7
Name:P2X purinoceptor 7
Type:Protein
Mol. Mass.:68602.85
Organism:Homo sapiens (Human)
Description:Q99572
Residue:595
BDBM173826
NameBDBM173826
Synonyms:US9102591, (+)2,3-dichloro-N-[2-(4-fluorophenyl)-2-[2-(trifluoromethyl)pyrimidin-5-yl]ethyl]benzamide US9649308, (-)2,3-dichloro-N-[2-(4-fluorophenyl)-2-[2-(trifluoromethyl)pyrimidin-5-yl]ethyl]benzamide
TypeSmall organic molecule
Emp. Form.C20H13Cl2F4N3O
Mol. Mass.458.236
SMILESFc1ccc(cc1)C(CNC(=O)c1cccc(Cl)c1Cl)c1cnc(nc1)C(F)(F)F