Reaction Details
TargetReceptor-type tyrosine-protein kinase FLT3
LigandBDBM50444241
Substrate/Competitorn/a
Meas. Tech.Activity Assay
IC50 55.0±n/a nM
Citation Wang, XZhang, WFrye, S Therapeutic uses of selected pyrimidine compounds with anti-Mer tyrosine kinase activity US Patent US9649309 Publication Date 5/16/2017
 
Receptor-type tyrosine-protein kinase FLT3
Name:Receptor-type tyrosine-protein kinase FLT3
Type:Enzyme
Mol. Mass.:112888.62
Organism:Homo sapiens (Human)
Description:P36888
Residue:993
BDBM50444241
NameBDBM50444241
Synonyms:CHEMBL3093756 | US9649309, Compound UNC2881A
TypeSmall organic molecule
Emp. Form.C25H33N7O2
Mol. Mass.463.5752
SMILESCCCCNc1ncc(C(=O)NCc2ccc(cc2)-n2ccnc2)c(N[C@H]2CC[C@H](O)CC2)n1