Reaction Details
TargetTyrosine-protein kinase Mer
LigandBDBM308187
Substrate/Competitorn/a
Meas. Tech.Activity Assay
IC50 1.30±n/a nM
Citation Wang, XZhang, WFrye, S Therapeutic uses of selected pyrimidine compounds with anti-Mer tyrosine kinase activity US Patent US9649309 Publication Date 5/16/2017
 
Tyrosine-protein kinase Mer
Name:Tyrosine-protein kinase Mer
Type:PROTEIN
Mol. Mass.:110234.77
Organism:Homo sapiens (Human)
Description:ChEMBL_1498723
Residue:999
BDBM308187
NameBDBM308187
Synonyms:US9649309, Compound UNC2491A
TypeSmall organic molecule
Emp. Form.C23H34N6O
Mol. Mass.410.5557
SMILESCCCCNc1ncc(c(NC2CC[C@H](O)CC2)n1)-c1ccc(CNC2CC2)cn1