Reaction Details
TargetTyrosine-protein kinase Mer
LigandBDBM308194
Substrate/Competitorn/a
Meas. Tech.Activity Assay
IC50 0.760±n/a nM
Citation Wang, XZhang, WFrye, S Therapeutic uses of selected pyrimidine compounds with anti-Mer tyrosine kinase activity US Patent US9649309 Publication Date 5/16/2017
 
Tyrosine-protein kinase Mer
Name:Tyrosine-protein kinase Mer
Type:PROTEIN
Mol. Mass.:110234.77
Organism:Homo sapiens (Human)
Description:ChEMBL_1498723
Residue:999
BDBM308194
NameBDBM308194
Synonyms:US9649309, Compound UNC2572A
TypeSmall organic molecule
Emp. Form.C27H36N6O
Mol. Mass.460.6143
SMILESCCCCNc1ncc(c(NC2CC[C@H](O)CC2)n1)-c1ccc(CNCc2ccccc2)cn1