Reaction Details
TargetTyrosine-protein kinase Mer
LigandBDBM308315
Substrate/Competitorn/a
Meas. Tech.Activity Assay
IC50 1.20±n/a nM
Citation Wang, XZhang, WFrye, S Therapeutic uses of selected pyrimidine compounds with anti-Mer tyrosine kinase activity US Patent US9649309 Publication Date 5/16/2017
 
Tyrosine-protein kinase Mer
Name:Tyrosine-protein kinase Mer
Type:PROTEIN
Mol. Mass.:110234.77
Organism:Homo sapiens (Human)
Description:ChEMBL_1498723
Residue:999
BDBM308315
NameBDBM308315
Synonyms:US9649309, Compound UNC3664A
TypeSmall organic molecule
Emp. Form.C26H38N6O2
Mol. Mass.466.6189
SMILESCCCCNc1ncc(c(NC2CCC(O)CC2)n1)-c1ccc(cn1)C1(CC1)N1CCOCC1