Reaction Details
TargetTyrosine-protein kinase Mer
LigandBDBM308317
Substrate/Competitorn/a
Meas. Tech.Activity Assay
IC50 0.940±n/a nM
Citation Wang, XZhang, WFrye, S Therapeutic uses of selected pyrimidine compounds with anti-Mer tyrosine kinase activity US Patent US9649309 Publication Date 5/16/2017
 
Tyrosine-protein kinase Mer
Name:Tyrosine-protein kinase Mer
Type:PROTEIN
Mol. Mass.:110234.77
Organism:Homo sapiens (Human)
Description:ChEMBL_1498723
Residue:999
BDBM308317
NameBDBM308317
Synonyms:US9649309, Compound UNC3666A
TypeSmall organic molecule
Emp. Form.C27H40N6O2
Mol. Mass.480.6455
SMILESCCCCNc1ncc(c(NC2CCC(O)CC2)n1)-c1ccc(cn1)C1(CCC1)N1CCOCC1