Reaction Details
TargetTyrosine-protein kinase receptor TYRO3
LigandBDBM308354
Substrate/Competitorn/a
Meas. Tech.Activity Assay
IC50 9.60±n/a nM
Citation Wang, XZhang, WFrye, S Therapeutic uses of selected pyrimidine compounds with anti-Mer tyrosine kinase activity US Patent US9649309 Publication Date 5/16/2017
 
Tyrosine-protein kinase receptor TYRO3
Name:Tyrosine-protein kinase receptor TYRO3
Type:Protein
Mol. Mass.:96894.13
Organism:Homo sapiens (Human)
Description:Q06418
Residue:890
BDBM308354
NameBDBM308354
Synonyms:US9649309, Compound UNC4169A
TypeSmall organic molecule
Emp. Form.C27H40N6O
Mol. Mass.464.6461
SMILESCCCCNc1ncc(c(N[C@H]2CC[C@H](O)CC2)n1)-c1ccc(CN2C3CCC2CCC3)cn1