Reaction Details
TargetEnteropeptidase
LigandBDBM308123
Substrate/Competitorn/a
Meas. Tech.Inhibitory Activity Assay
Ki 0.290±n/a nM
Citation Koshiba, TTokumasu, MIchimaru, TOhsumi, KNakagawa, TYamada, TMatsumoto, KSuzuki, T Heteroarylcarboxylic acid ester derivative US Patent US9655879 Publication Date 5/23/2017
 
Enteropeptidase
Name:Enteropeptidase
Type:Enzyme
Mol. Mass.:112901.62
Organism:Homo sapiens (Human)
Description:P98073
Residue:1019
BDBM308123
NameBDBM308123
Synonyms:US9655879, 3
TypeSmall organic molecule
Emp. Form.C19H21ClFN3O5S
Mol. Mass.457.904
SMILESCl.CC(C)(Cc1ccc(s1)C(=O)Oc1ccc(cc1F)C(N)=N)C(=O)NCC(O)=O