Reaction Details
TargetEnteropeptidase
LigandBDBM308247
Substrate/Competitorn/a
Meas. Tech.Inhibitory Activity Assay
Ki 0.410±n/a nM
Citation Koshiba, TTokumasu, MIchimaru, TOhsumi, KNakagawa, TYamada, TMatsumoto, KSuzuki, T Heteroarylcarboxylic acid ester derivative US Patent US9655879 Publication Date 5/23/2017
 
Enteropeptidase
Name:Enteropeptidase
Type:Enzyme
Mol. Mass.:112901.62
Organism:Homo sapiens (Human)
Description:P98073
Residue:1019
BDBM308247
NameBDBM308247
Synonyms:US9655879, 11
TypeSmall organic molecule
Emp. Form.C22H27ClFN3O6S
Mol. Mass.515.983
SMILESCl.CCC(CC)(Cc1ccc(s1)C(=O)Oc1ccc(cc1F)C(N)=N)C(=O)N[C@@H](CO)C(O)=O